facebook/react-native: A framework for building native applications using React

99492
STARS
3672
WATCHERS
21466
FORKS
2128
ISSUES

react-native's Language Statistics

facebook's Other Repos

Star history of react-native
Issue history of react-native

react-native Recent Issues

Issue Title State Comments Created Date Updated Date Closed Date
FlatListI write this code: auto center scroll open 0 2021-11-26 2021-11-27 -
Warning: Failed prop type: Invalid prop `autoComplete` of value `password-new` supplied to `ForwardRef(TextInput)`, expected one of ["cc-csc","cc-exp","cc-exp-month","cc-exp-year","cc-number","email","name","password","postal-code","street-address","tel","username","off"]. open 0 2021-11-26 2021-11-20 -
A problem occurred evaluating settings 'test'. > Could not read script '/Users/deepak.narang/Desktop/react-native/test/node_modules/@react-native-community/cli-platform-android/native_modules.gradle' as it does not exist. open 0 2021-11-26 2021-11-20 -
ReferenceError: Can't find variable: IDBIndex open 0 2021-11-26 2021-11-20 -
iOS 14.x+ network issue: finished with error [-1017] Error Domain=NSURLErrorDomain Code=-1017 "Parsen der Antwort nicht möglich" open 1 2021-11-26 2021-11-27 -
[Android]: get unknown property configureNdkBuildDebug closed 7 2021-11-25 2021-11-20 2021-11-26
RCTTextView crash in iOS 14 open 0 2021-11-25 2021-11-20 -
React Native - gradle, manifest merge error open 0 2021-11-25 2021-11-20 -
Scrollview scrollToEnd stops in the middle when the list is long open 0 2021-11-24 2021-11-20 -
onPanResponderTerminationRequest never called in Android open 0 2021-11-24 2021-11-27 -
ForwardingCookieHandler.java line 136 open 0 2021-11-24 2021-11-20 -
libjsc.so + 0xf7748 open 0 2021-11-24 2021-11-20 -
RCTUIImageViewAnimated crash in iOS 15 open 1 2021-11-24 2021-11-20 -
An error occurred when update the MainApplication - getPackages() method in android closed 0 2021-11-24 2021-11-20 2021-11-24
Fatal Exception: parameter must be a descendant of this view - ReactScrollView.java line 218 open 7 2021-11-24 2021-11-20 -
conditional fontFamily switches once but doesn't switch back on TextInput still not working open 0 2021-11-23 2021-11-20 -
Custom font clipping when setting textAlign:right open 0 2021-11-23 2021-11-20 -
YogaKit.modulemap not found when archiving with Xcode 13 closed 1 2021-11-22 2021-11-27 2021-11-26
com.facebook.react.common.JavascriptException: TypeError: l._unsubscribe1 is not a function. (In 'l._unsubscribe1()', 'l._unsubscribe1' is undefined) Issue open 0 2021-11-22 2021-11-20 -
Images with large size not fully loaded open 0 2021-11-20 2021-11-20 -
react native android BUILD FAILED for a new project on windows closed 2 2021-11-20 2021-11-20 2021-11-20
Unable to create a new react native app open 2 2021-11-20 2021-11-20 -
Method addObserver must be called on the main thread open 0 2021-11-20 2021-11-20 -
React Native ScrollView fetch data from page open 3 2021-11-19 2021-11-20 -
AppState is not changes when I pull down the notifications bar (RN 0.66, Android 12, Pixel 4a) open 0 2021-11-19 2021-11-20 -
TouchableOpacity onPress won't fire every time open 3 2021-11-19 2021-11-20 -
mac m1 build android BUILD SUCCESSFUL in 2h 7m 54s open 2 2021-11-19 2021-11-20 -
Accessibility Issue On IOS - Doubling tapping a Pressable active the child button open 1 2021-11-19 2021-11-20 -
error Failed to run jetifier open 1 2021-11-18 2021-11-20 -
ReactPicker (com.facebook.react.views.picker) package does not exist after upgrade 65 -> 66 closed 1 2021-11-18 2021-11-20 2021-11-18
App crash when start debugging with chrome. rn version 0.66.3 open 0 2021-11-18 2021-11-20 -
UI not rendering properly when clicked on push notifications in IOS closed 1 2021-11-18 2021-11-20 2021-11-26
Incorrect Android APIs in README requirements. react-native 0.64 open 4 2021-11-18 2021-11-20 -
Invalid deadline value returned by timeRemaining() in requestIdleCallback() open 0 2021-11-18 2021-11-20 -
RNTester: Text elements with custom accessibility actions don't work on iOS open 1 2021-11-18 2021-11-20 -
Android text is displaced and hidden when using letterSpacing and textAlign right open 0 2021-11-17 2021-11-20 -
[RefreshControll] Spinner freezes when I navigate to another Screen open 0 2021-11-17 2021-11-20 -
KeyboardAvoidingView Android white area when keyboard open/close open 1 2021-11-17 2021-11-20 -
Android TV remote with separate buttons for play and pause not working. open 0 2021-11-17 2021-11-20 -
KeyboardAvoidingView does not handle the onLayout prop correctly closed 0 2021-11-16 2021-11-20 2021-11-24
Unable to get DeepLinking URL using Linking.getInitialURL() if app is opened after unlocking open 0 2021-11-16 2021-11-20 -
Keep reference to Callback after app gets killed and restarted open 0 2021-11-16 2021-11-20 -
Webpack error post enabling hermes in android open 0 2021-11-16 2021-11-20 -
Android: Controlled TextInput Issue open 2 2021-11-15 2021-11-20 -
XCode 13 can not link/find third party .a when build with simulator open 7 2021-11-15 2021-11-20 -
[Android]: Linking incompatible target in debug mode on Manjaro Linux closed 4 2021-11-15 2021-11-27 2021-11-25
RN 0.66 Switch causes a stuck operation in mViewCommandOperations open 1 2021-11-15 2021-11-20 -
multiple scrollView in screen dont snap correctly open 0 2021-11-14 2021-11-20 -
[cli] unable to talk to your watchman on ... (No such file or directory) open 0 2021-11-14 2021-11-20 -
[Android] VirtualizedList: Encountered an error while measuring a list's offset from its containing VirtualizedList. open 0 2021-11-13 2021-11-20 -